Reaction Details
TargetPotassium voltage-gated channel subfamily H member 2
LigandBDBM50205455
Substrate/Competitorn/a
Meas. Tech.ChEMBL_438371 (CHEMBL886338)
Ki 112000±n/a nM
Citation Murphy, STCase, HLEllsworth, EHagen, SHuband, MJoannides, TLimberakis, CMarotti, KROttolini, AMRauckhorst, MStarr, JStier, MTaylor, CZhu, TBlaser, ADenny, WALu, GLSmaill, JBRivault, F The synthesis and biological evaluation of novel series of nitrile-containing fluoroquinolones as antibacterial agents. Bioorg Med Chem Lett17:2150-5 (2007) 
 
Potassium voltage-gated channel subfamily H member 2
Name:Potassium voltage-gated channel subfamily H member 2
Type:Multi-pass membrane protein
Mol. Mass.:126672.65
Organism:Homo sapiens (Human)
Description:Q12809
Residue:1159
BDBM50205455
NameBDBM50205455
Synonyms:7-(3-(aminomethyl)-3-methylazetidin-1-yl)-1-cyclopropyl-6-fluoro-8-methyl-4-oxo-1,4-dihydroquinoline-3-carboxylic acid | CHEMBL230916
TypeSmall organic molecule
Emp. Form.C19H22FN3O3
Mol. Mass.359.3947
SMILESCc1c(N2CC(C)(CN)C2)c(F)cc2c1n(cc(C(O)=O)c2=O)C1CC1