Reaction Details
TargetProtein kinase C alpha type
LigandBDBM50205472
Substrate/Competitorn/a
Meas. Tech.ChEMBL_442372 (CHEMBL892534)
Ki>2000±n/a nM
Citation Chen, SChen, LLe, NTZhao, CSidduri, ALou, JPMichoud, CPortland, LJackson, NLiu, JJKonzelmann, FChi, FTovar, CXiang, QChen, YWen, YVassilev, LT Synthesis and activity of quinolinyl-methylene-thiazolinones as potent and selective cyclin-dependent kinase 1 inhibitors. Bioorg Med Chem Lett17:2134-8 (2007) 
 
Protein kinase C alpha type
Name:Protein kinase C alpha type
Type:Enzyme
Mol. Mass.:76755.65
Organism:Homo sapiens (Human)
Description:The recombinant human PKC enzymes were produced using a baculovirus expression system in SF9 cells
Residue:672
BDBM50205472
NameBDBM50205472
Synonyms:(5Z)-5-(quinolin-6-ylmethylidene)-2-[(thiophen-2-ylmethyl)amino]-1,3-thiazol-4(5H)-one CHEMBL261644 | CHEMBL393929
TypeSmall organic molecule
Emp. Form.C18H13N3OS2
Mol. Mass.351.445
SMILESO=C1N=C(NCc2cccs2)SC1=Cc1ccc2ncccc2c1