Reaction Details
TargetCyclin-dependent kinase 1
LigandBDBM50205475
Substrate/Competitorn/a
Meas. Tech.ChEMBL_442383 (CHEMBL892545)
IC50 1390±n/a nM
Citation Chen, SChen, LLe, NTZhao, CSidduri, ALou, JPMichoud, CPortland, LJackson, NLiu, JJKonzelmann, FChi, FTovar, CXiang, QChen, YWen, YVassilev, LT Synthesis and activity of quinolinyl-methylene-thiazolinones as potent and selective cyclin-dependent kinase 1 inhibitors. Bioorg Med Chem Lett17:2134-8 (2007) 
 
Cyclin-dependent kinase 1
Name:Cyclin-dependent kinase 1
Type:Enzyme Subunit
Mol. Mass.:34101.08
Organism:Homo sapiens (Human)
Description:P06493
Residue:297
BDBM50205475
NameBDBM50205475
Synonyms:(R,Z)-2-(1-hydroxy-3-phenylpropan-2-ylamino)-5-(quinolin-6-ylmethylene)thiazol-4(5H)-one | CHEMBL393157
TypeSmall organic molecule
Emp. Form.C22H19N3O2S
Mol. Mass.389.47
SMILESOC[C@@H](Cc1ccccc1)NC1=NC(=O)C(S1)=Cc1ccc2ncccc2c1