Reaction Details
TargetTyrosine-protein kinase Fyn
LigandBDBM50205468
Substrate/Competitorn/a
Meas. Tech.ChEMBL_442376 (CHEMBL892538)
Ki>2000±n/a nM
Citation Chen, SChen, LLe, NTZhao, CSidduri, ALou, JPMichoud, CPortland, LJackson, NLiu, JJKonzelmann, FChi, FTovar, CXiang, QChen, YWen, YVassilev, LT Synthesis and activity of quinolinyl-methylene-thiazolinones as potent and selective cyclin-dependent kinase 1 inhibitors. Bioorg Med Chem Lett17:2134-8 (2007) 
 
Tyrosine-protein kinase Fyn
Name:Tyrosine-protein kinase Fyn
Type:Enzyme
Mol. Mass.:60762.21
Organism:Homo sapiens (Human)
Description:P06241
Residue:537
BDBM50205468
NameBDBM50205468
Synonyms:(Z)-2-amino-5-(quinolin-6-ylmethylene)thiazol-4(5H)-one | CHEMBL396377
TypeSmall organic molecule
Emp. Form.C13H9N3OS
Mol. Mass.255.295
SMILESNC1=NC(=O)C(S1)=Cc1ccc2ncccc2c1