Reaction Details
TargetMitogen-activated protein kinase 1
LigandBDBM50205472
Substrate/Competitorn/a
Meas. Tech.ChEMBL_442374 (CHEMBL892536)
Ki 2000±n/a nM
Citation Chen, SChen, LLe, NTZhao, CSidduri, ALou, JPMichoud, CPortland, LJackson, NLiu, JJKonzelmann, FChi, FTovar, CXiang, QChen, YWen, YVassilev, LT Synthesis and activity of quinolinyl-methylene-thiazolinones as potent and selective cyclin-dependent kinase 1 inhibitors. Bioorg Med Chem Lett17:2134-8 (2007) 
 
Mitogen-activated protein kinase 1
Name:Mitogen-activated protein kinase 1
Type:Ser/Thr Protein Kinase
Mol. Mass.:41392.76
Organism:Homo sapiens (Human)
Description:P28482
Residue:360
BDBM50205472
NameBDBM50205472
Synonyms:(5Z)-5-(quinolin-6-ylmethylidene)-2-[(thiophen-2-ylmethyl)amino]-1,3-thiazol-4(5H)-one CHEMBL261644 | CHEMBL393929
TypeSmall organic molecule
Emp. Form.C18H13N3OS2
Mol. Mass.351.445
SMILESO=C1N=C(NCc2cccs2)SC1=Cc1ccc2ncccc2c1