Reaction Details
TargetCytosolic phospholipase A2
LigandBDBM50205532
Substrate/Competitorn/a
Meas. Tech.ChEMBL_428330 (CHEMBL917108)
IC50 120±n/a nM
Citation Lee, KLFoley, MAChen, LBehnke, MLLovering, FEKirincich, SJWang, WShim, JTam, SShen, MWKhor, SXu, XGoodwin, DGRamarao, MKNickerson-Nutter, CDonahue, FKu, MSClark, JDMcKew, JC Discovery of Ecopladib, an indole inhibitor of cytosolic phospholipase A2alpha. J Med Chem50:1380-400 (2007) 
 
Cytosolic phospholipase A2
Name:Cytosolic phospholipase A2
Type:Protein
Mol. Mass.:85219.30
Organism:Homo sapiens (Human)
Description:P47712
Residue:749
BDBM50205532
NameBDBM50205532
Synonyms:4-{2-[1-benzhydryl-5-nitro-2-(3-phenylmethanesulfonyl-propyl)-1H-indol-3-yl]-ethoxy}-benzoic acid | CHEMBL220736
TypeSmall organic molecule
Emp. Form.C39H35N3O7S
Mol. Mass.689.776
SMILESOC(=O)c1ccc(OCCc2c(CCNS(=O)(=O)Cc3ccccc3)n(C(c3ccccc3)c3ccccc3)c3ccc(cc23)[N+]([O-])=O)cc1