Reaction Details
TargetGamma-aminobutyric acid receptor subunit alpha-3/beta-2/gamma-2
LigandBDBM50000766
Substrate/Competitorn/a
Meas. Tech.ChEMBL_435783 (CHEMBL904138)
Ki 14±n/a nM
Citation Guerrini, GCiciani, GCambi, GBruni, FSelleri, SBesnard, FMontali, MMartini, CGhelardini, CGaleotti, NCostanzo, A Novel 3-iodo-8-ethoxypyrazolo[5,1-c][1,2,4]benzotriazine 5-oxide as promising lead for design of alpha5-inverse agonist useful tools for therapy of mnemonic damage. Bioorg Med Chem15:2573-86 (2007) 
 
Gamma-aminobutyric acid receptor subunit alpha-3/beta-2/gamma-2
Name:Gamma-aminobutyric acid receptor subunit alpha-3/beta-2/gamma-2
Type:n/a
Mol. Mass.:n/a
Description:ASSAY_ID of EBI is 68412
Components:This complex has 3 components.
Component 1
Name:Gamma-aminobutyric acid receptor subunit beta-2
Synonyms:GBRB2_RAT Gabrb2 | Gamma-aminobutyric acid receptor subunit beta-2 (GABA(A) beta-2)
Type:Enzyme
Mol. Mass.:54648.97
Organism:Rattus norvegicus (Rat)
Description:P63138
Residue:474
Component 2
Name:Gamma-aminobutyric acid receptor subunit gamma-2
Synonyms:GBRG2_RAT Gamma-aminobutyric acid receptor subunit gamma-2 (GABA(A) gamma-2)
Type:Enzyme
Mol. Mass.:54087.63
Organism:Rattus norvegicus (Rat)
Description:P18508
Residue:466
Component 3
Name:Gamma-aminobutyric acid receptor subunit alpha-3
Synonyms:GABA A anti-Alpha3 GABA receptor alpha-3 subunit Gabra-3 Gamma-aminobutyric acid receptor subunit alpha-3
Type:Enzyme Catalytic Domain
Mol. Mass.:55444.88
Organism:RAT
Description:GABA A Alpha3Beta2Gamma2 0 RAT::P20236
Residue:493
BDBM50000766
NameBDBM50000766
Synonyms:CHEMBL12 US9271961, Diazepam
TypeSmall organic molecule
Emp. Form.C16H13ClN2O
Mol. Mass.284.74
SMILESCN1c2ccc(Cl)cc2C(=NCC1=O)c1ccccc1