Reaction Details
TargetKappa-type opioid receptor
LigandBDBM50205677
Substrate/Competitorn/a
Meas. Tech.ChEMBL_438435 (CHEMBL887536)
Ki 1.3±n/a nM
Citation Chu, GHGu, MCassel, JABelanger, SGraczyk, TMDeHaven, RNConway-James, NKoblish, MLittle, PJDeHaven-Hudkins, DLDolle, RE Novel malonamide derivatives as potent kappa opioid receptor agonists. Bioorg Med Chem Lett17:1951-5 (2007) 
 
Kappa-type opioid receptor
Name:Kappa-type opioid receptor
Type:G Protein-Coupled Receptor (GPCR)
Mol. Mass.:42648.76
Organism:Homo sapiens (Human)
Description:P41145
Residue:380
BDBM50205677
NameBDBM50205677
Synonyms:CHEMBL425836 | N1-((S)-2-((S)-3-hydroxypyrrolidin-1-yl)-1-phenylethyl)-N1-methyl-N3-(pyridin-3-yl)malonamide
TypeSmall organic molecule
Emp. Form.C21H26N4O3
Mol. Mass.382.4561
SMILESCN([C@H](CN1CC[C@H](O)C1)c1ccccc1)C(=O)CC(=O)Nc1cccnc1