Reaction Details
Target5-hydroxytryptamine receptor 2C
LigandBDBM50205898
Substrate/Competitorn/a
Meas. Tech.ChEMBL_428469 (CHEMBL918970)
EC50 94±n/a nM
Citation Wacker, DAVarnes, JGMalmstrom, SECao, XHung, CPUng, TWu, GZhang, GZuvich, EThomas, MAKeim, WJCullen, MJRohrbach, KWQu, QNarayanan, RRossi, KJanovitz, ELehman-McKeeman, LMalley, MFDevenny, JPelleymounter, MAMiller, KJRobl, JA Discovery of (R)-9-ethyl-1,3,4,10b-tetrahydro-7-trifluoromethylpyrazino[2,1-a]isoindol- 6(2H)-one, a selective, orally active agonist of the 5-HT(2C) receptor. J Med Chem50:1365-79 (2007) 
 
5-hydroxytryptamine receptor 2C
Name:5-hydroxytryptamine receptor 2C
Type:G Protein-Coupled Receptor (GPCR)
Mol. Mass.:51836.79
Organism:Homo sapiens (Human)
Description:P28335
Residue:458
BDBM50205898
NameBDBM50205898
Synonyms:(R)-9-propyl-1,3,4,10b-tetrahydro-7-trifluoromethylpyrazino-[2,1-a]isoindol-6(2H)-one | CHEMBL373905
TypeSmall organic molecule
Emp. Form.C15H17F3N2O
Mol. Mass.298.3035
SMILESCCCc1cc2[C@@H]3CNCCN3C(=O)c2c(c1)C(F)(F)F