Reaction Details
Target5-hydroxytryptamine receptor 2A
LigandBDBM50205861
Substrate/Competitorn/a
Meas. Tech.ChEMBL_428464 (CHEMBL918965)
Ki 59±n/a nM
Citation Wacker, DAVarnes, JGMalmstrom, SECao, XHung, CPUng, TWu, GZhang, GZuvich, EThomas, MAKeim, WJCullen, MJRohrbach, KWQu, QNarayanan, RRossi, KJanovitz, ELehman-McKeeman, LMalley, MFDevenny, JPelleymounter, MAMiller, KJRobl, JA Discovery of (R)-9-ethyl-1,3,4,10b-tetrahydro-7-trifluoromethylpyrazino[2,1-a]isoindol- 6(2H)-one, a selective, orally active agonist of the 5-HT(2C) receptor. J Med Chem50:1365-79 (2007) 
 
5-hydroxytryptamine receptor 2A
Name:5-hydroxytryptamine receptor 2A
Type:undefined
Mol. Mass.:52607.65
Organism:Homo sapiens (Human)
Description:P28223
Residue:471
BDBM50205861
NameBDBM50205861
Synonyms:(R)-1,3,4,10b-tetrahydro-7-trifluoromethylpyrazino[2,1-a]isoindol-6(2H)-one | CHEMBL222514
TypeSmall organic molecule
Emp. Form.C12H11F3N2O
Mol. Mass.256.2237
SMILESFC(F)(F)c1cccc2[C@@H]3CNCCN3C(=O)c12