Reaction Details
TargetNitric oxide synthase, inducible
LigandBDBM50205907
Substrate/Competitorn/a
Meas. Tech.ChEMBL_428500 (CHEMBL920402)
IC50 0.52±n/a nM
Citation Davey, DDAdler, MArnaiz, DEagen, KErickson, SGuilford, WKenrick, MMorrissey, MMOhlmeyer, MPan, GParadkar, VMParkinson, JPolokoff, MSaionz, KSantos, CSubramanyam, BVergona, RWei, RGWhitlow, MYe, BZhao, ZSDevlin, JJPhillips, G Design, synthesis, and activity of 2-imidazol-1-ylpyrimidine derived inducible nitric oxide synthase dimerization inhibitors. J Med Chem50:1146-57 (2007) 
 
Nitric oxide synthase, inducible
Name:Nitric oxide synthase, inducible
Type:Homodimer
Mol. Mass.:131141.95
Organism:Homo sapiens (Human)
Description:P35228
Residue:1153
BDBM50205907
NameBDBM50205907
Synonyms:(2R)-N-(2-(benzo[d][1,3]dioxol-5-yl)ethyl)-1-(6-ethyl-2-(1H-imidazol-1-yl)pyrimidin-4-yl)pyrrolidine-2-carboxamide | CHEMBL221208
TypeSmall organic molecule
Emp. Form.C23H26N6O3
Mol. Mass.434.4909
SMILESCCc1cc(nc(n1)-n1ccnc1)N1CCC[C@@H]1C(=O)NCCc1ccc2OCOc2c1