Reaction Details
TargetNitric oxide synthase, inducible
LigandBDBM50205905
Substrate/Competitorn/a
Meas. Tech.ChEMBL_428500 (CHEMBL920402)
IC50 0.5±n/a nM
Citation Davey, DDAdler, MArnaiz, DEagen, KErickson, SGuilford, WKenrick, MMorrissey, MMOhlmeyer, MPan, GParadkar, VMParkinson, JPolokoff, MSaionz, KSantos, CSubramanyam, BVergona, RWei, RGWhitlow, MYe, BZhao, ZSDevlin, JJPhillips, G Design, synthesis, and activity of 2-imidazol-1-ylpyrimidine derived inducible nitric oxide synthase dimerization inhibitors. J Med Chem50:1146-57 (2007) 
 
Nitric oxide synthase, inducible
Name:Nitric oxide synthase, inducible
Type:Homodimer
Mol. Mass.:131141.95
Organism:Homo sapiens (Human)
Description:P35228
Residue:1153
BDBM50205905
NameBDBM50205905
Synonyms:CHEMBL376713 | N-[(1,3-benzodioxol-5-yl)methyl]-1-[2-(1H-imidazol-1-yl)pyrimidin-4-yl]-4-(methylsulfonyl)-2-piperazineacetamide
TypeSmall organic molecule
Emp. Form.C30H31N7O5
Mol. Mass.569.611
SMILESO=C(CC1CN(CCN1c1ccnc(n1)-n1ccnc1)C(=O)COCc1ccccc1)NCc1ccc2OCOc2c1