Reaction Details
TargetNitric oxide synthase, inducible
LigandBDBM50205904
Substrate/Competitorn/a
Meas. Tech.ChEMBL_428500 (CHEMBL920402)
IC50 0.8±n/a nM
Citation Davey, DDAdler, MArnaiz, DEagen, KErickson, SGuilford, WKenrick, MMorrissey, MMOhlmeyer, MPan, GParadkar, VMParkinson, JPolokoff, MSaionz, KSantos, CSubramanyam, BVergona, RWei, RGWhitlow, MYe, BZhao, ZSDevlin, JJPhillips, G Design, synthesis, and activity of 2-imidazol-1-ylpyrimidine derived inducible nitric oxide synthase dimerization inhibitors. J Med Chem50:1146-57 (2007) 
 
Nitric oxide synthase, inducible
Name:Nitric oxide synthase, inducible
Type:Homodimer
Mol. Mass.:131141.95
Organism:Homo sapiens (Human)
Description:P35228
Residue:1153
BDBM50205904
NameBDBM50205904
Synonyms:1-[2-(1H-imidazol-1-yl)-4-pyrimidinyl]-N-[(4-methoxyphenyl-)methyl]-2-piperidineacetamide | CHEMBL374681
TypeSmall organic molecule
Emp. Form.C22H26N6O2
Mol. Mass.406.4808
SMILESCOc1ccc(CNC(=O)CC2CCCCN2c2ccnc(n2)-n2ccnc2)cc1