Reaction Details
Target5-hydroxytryptamine receptor 7
LigandBDBM50206183
Substrate/Competitorn/a
Meas. Tech.ChEMBL_454683 (CHEMBL886703)
Ki 100±n/a nM
Citation Suckling, CJMurphy, JAKhalaf, AIZhou, SZLizos, DEvan Nhien, ANYasumatsu, HMcVie, AYoung, LCMcCraw, CWaterman, PGMorris, BJPratt, JAHarvey, AL M4 agonists/5HT7 antagonists with potential as antischizophrenic drugs: serominic compounds. Bioorg Med Chem Lett17:2649-55 (2007) 
 
5-hydroxytryptamine receptor 7
Name:5-hydroxytryptamine receptor 7
Type:G Protein-Coupled Receptor (GPCR)
Mol. Mass.:53573.08
Organism:Homo sapiens (Human)
Description:P34969
Residue:479
BDBM50206183
NameBDBM50206183
Synonyms:(E)-6-((benzyl(methyl)amino)methyleneamino)-2,3-dihydro-1H-inden-1-yl acetate | CHEMBL240025
TypeSmall organic molecule
Emp. Form.C20H22N2O2
Mol. Mass.322.4009
SMILESCN(Cc1ccccc1)\C=N\c1ccc2CCC(OC(C)=O)c2c1