Reaction Details
TargetHistamine H3 receptor
LigandBDBM50206233
Substrate/Competitorn/a
Meas. Tech.ChEMBL_454704 (CHEMBL886726)
Ki 1.6±n/a nM
Citation Keith, JMGomez, LAWolin, RLBarbier, AJWilson, SJBoggs, JDMazur, CFraser, ICLord, BAluisio, LLovenberg, TWCarruthers, NI Pyrrolidino-tetrahydroisoquinolines as potent dual H3 antagonist and serotonin transporter inhibitors. Bioorg Med Chem Lett17:2603-7 (2007) 
 
Histamine H3 receptor
Name:Histamine H3 receptor
Type:G Protein-Coupled Receptor (GPCR)
Mol. Mass.:48691.47
Organism:Homo sapiens (Human)
Description:Binding assays were using CHO cells stably expressing hH3R receptors.
Residue:445
BDBM50206233
NameBDBM50206233
Synonyms:CHEMBL238951 | N,N-dimethyl-4-(9-(3-(piperidin-1-yl)propoxy)-1,2,3,5,6,10b-hexahydropyrrolo[2,1-a]isoquinolin-6-yl)benzenamine
TypeSmall organic molecule
Emp. Form.C28H39N3O
Mol. Mass.433.6288
SMILESCN(C)c1ccc(cc1)C1CN2CCCC2c2cc(OCCCN3CCCCC3)ccc12