Reaction Details
TargetHistamine H3 receptor
LigandBDBM50206232
Substrate/Competitorn/a
Meas. Tech.ChEMBL_454704 (CHEMBL886726)
Ki 2±n/a nM
Citation Keith, JMGomez, LAWolin, RLBarbier, AJWilson, SJBoggs, JDMazur, CFraser, ICLord, BAluisio, LLovenberg, TWCarruthers, NI Pyrrolidino-tetrahydroisoquinolines as potent dual H3 antagonist and serotonin transporter inhibitors. Bioorg Med Chem Lett17:2603-7 (2007) 
 
Histamine H3 receptor
Name:Histamine H3 receptor
Type:G Protein-Coupled Receptor (GPCR)
Mol. Mass.:48691.47
Organism:Homo sapiens (Human)
Description:Binding assays were using CHO cells stably expressing hH3R receptors.
Residue:445
BDBM50206232
NameBDBM50206232
Synonyms:6-(3-ethynylphenyl)-9-(3-(piperidin-1-yl)propoxy)-1,2,3,5,6,10b-hexahydropyrrolo[2,1-a]isoquinoline | CHEMBL240467
TypeSmall organic molecule
Emp. Form.C28H34N2O
Mol. Mass.414.5824
SMILESC#Cc1cccc(c1)C1CN2CCCC2c2cc(OCCCN3CCCCC3)ccc12