Reaction Details
TargetVascular endothelial growth factor receptor 2
LigandBDBM50206281
Substrate/Competitorn/a
Meas. Tech.ChEMBL_442539 (CHEMBL892704)
IC50 7±n/a nM
Citation Huang, SLi, RConnolly, PJEmanuel, SFuentes-Pesquera, AAdams, MGruninger, RHSeraj, JMiddleton, SADavis, JMMoffat, DF Synthesis and biological study of 2-amino-4-aryl-5-chloropyrimidine analogues as inhibitors of VEGFR-2 and cyclin dependent kinase 1 (CDK1). Bioorg Med Chem Lett17:2179-83 (2007) 
 
Vascular endothelial growth factor receptor 2
Name:Vascular endothelial growth factor receptor 2
Type:Receptor Tyrosine Kinase
Mol. Mass.:151510.97
Organism:Homo sapiens (Human)
Description:P35968
Residue:1356
BDBM50206281
NameBDBM50206281
Synonyms:5-chloro-N-(4-(2-(dimethylamino)ethyl)phenyl)-4-(1H-indol-3-yl)pyrimidin-2-amine | CHEMBL234452
TypeSmall organic molecule
Emp. Form.C22H22ClN5
Mol. Mass.391.897
SMILESCN(C)CCc1ccc(Nc2ncc(Cl)c(n2)-c2c[nH]c3ccccc23)cc1