Reaction Details
TargetMitogen-activated protein kinase 14
LigandBDBM50206421
Substrate/Competitorn/a
Meas. Tech.ChEMBL_428526 (CHEMBL919883)
IC50 450±n/a nM
Citation Peifer, CKinkel, KAbadleh, MSchollmeyer, DLaufer, S From five- to six-membered rings: 3,4-diarylquinolinone as lead for novel p38MAP kinase inhibitors. J Med Chem50:1213-21 (2007) 
 
Mitogen-activated protein kinase 14
Name:Mitogen-activated protein kinase 14
Type:Serine/threonine-protein kinase
Mol. Mass.:41286.76
Organism:Homo sapiens (Human)
Description:Q16539
Residue:360
BDBM50206421
NameBDBM50206421
Synonyms:3-(4-fluorophenyl)-5-isopropyl-4-(pyridin-4-yl)isoxazole 4-[3-(4-fluorophenyl)-5-isopropylisoxazol-4-yl]pyridine | CHEMBL220227
TypeSmall organic molecule
Emp. Form.C17H15FN2O
Mol. Mass.282.3122
SMILESCC(C)c1onc(c1-c1ccncc1)-c1ccc(F)cc1