Reaction Details
TargetSigma non-opioid intracellular receptor 1
LigandBDBM50035131
Substrate/Competitorn/a
Meas. Tech.ChEMBL_428724 (CHEMBL915240)
Ki 3.1±n/a nM
Citation Prezzavento, OCampisi, ARonsisvalle, SLi Volti, GMarrazzo, ABramanti, VCannavò, GVanella, LCagnotto, AMennini, TIentile, RRonsisvalle, G Novel sigma receptor ligands: synthesis and biological profile. J Med Chem50:951-61 (2007) 
 
Sigma non-opioid intracellular receptor 1
Name:Sigma non-opioid intracellular receptor 1
Type:Protein
Mol. Mass.:25307.17
Organism:Cavia porcellus (Guinea pig)
Description:Q60492
Residue:223
BDBM50035131
NameBDBM50035131
Synonyms:(+)-(6R,11S)-6,11-dimethyl-3-(3-methyl-but-2-enyl)-1,2,3,4,5,6-hexahydro-2,6-methano-benzo[d]azocin-8-ol (1S,9S,13S)-1,13-dimethyl-10-(3-methylbut-2-enyl)-10-azatricyclo[7.3.1.0~2,7~]trideca-2,4,6-trien-4-ol (2R,6R,11S)-6,11-dimethyl-3-(3-methyl-but-2-enyl)-1,2,3,4,5,6-hexahydro-2,6-methano-benzo[d]azocin-8-ol (2S,6S,11S)-6,11-Dimethyl-3-(3-methyl-but-2-enyl)-1,2,3,4,5,6-hexahydro-2,6-methano-benzo[d]azocin-8-ol 6,11-Dimethyl-3-(3-methyl-but-2-enyl)-1,2,3,4,5,6-hexahydro-2,6-ethano-benzo[d]azocin-8-ol(+)-pentazocine 6,11-Dimethyl-3-(3-methyl-but-2-enyl)-1,2,3,4,5,6-hexahydro-2,6-methano-benzo[d]azocin-8-ol ((+)-pentazocine) 6,11-Dimethyl-3-(3-methyl-but-2-enyl)-1,2,3,4,5,6-hexahydro-2,6-methano-benzo[d]azocin-8-ol((+)pentazocine) | CHEMBL60542
TypeSmall organic molecule
Emp. Form.C19H27NO
Mol. Mass.285.4238
SMILES[#6]-[#6@@H]1-[#6@@H]-2-[#6]-c3ccc(-[#8])cc3[C@@]1([#6])[#6]-[#6]-[#7]-2-[#6]\[#6]=[#6](/[#6])-[#6]