Reaction Details
TargetDelta-type opioid receptor
LigandBDBM50206660
Substrate/Competitorn/a
Meas. Tech.ChEMBL_438448 (CHEMBL887548)
Ki 2900±n/a nM
Citation Lee, YSNyberg, JMoye, SAgnes, RSDavis, PMa, SWLai, JPorreca, FVardanyan, RHruby, VJ Understanding the structural requirements of 4-anilidopiperidine analogues for biological activities at mu and delta opioid receptors. Bioorg Med Chem Lett17:2161-5 (2007) 
 
Delta-type opioid receptor
Name:Delta-type opioid receptor
Type:G Protein-Coupled Receptor (GPCR)
Mol. Mass.:40382.98
Organism:Homo sapiens (Human)
Description:Competition binding assays were carried out using membrane preparations from transfected HN9.10 cells that constitutively expressed the delta opioid receptor.
Residue:372
BDBM50206660
NameBDBM50206660
Synonyms:CHEMBL231049 | N-(1-(3-amino-3-p-tolylpropanoyl)piperidin-4-yl)-N-phenylpropionamide
TypeSmall organic molecule
Emp. Form.C24H31N3O2
Mol. Mass.393.5218
SMILESCCC(=O)N(C1CCN(CC1)C(=O)CC(N)c1ccc(C)cc1)c1ccccc1