Reaction Details
TargetDelta-type opioid receptor
LigandBDBM50206655
Substrate/Competitorn/a
Meas. Tech.ChEMBL_438448 (CHEMBL887548)
Ki 6900±n/a nM
Citation Lee, YSNyberg, JMoye, SAgnes, RSDavis, PMa, SWLai, JPorreca, FVardanyan, RHruby, VJ Understanding the structural requirements of 4-anilidopiperidine analogues for biological activities at mu and delta opioid receptors. Bioorg Med Chem Lett17:2161-5 (2007) 
 
Delta-type opioid receptor
Name:Delta-type opioid receptor
Type:G Protein-Coupled Receptor (GPCR)
Mol. Mass.:40382.98
Organism:Homo sapiens (Human)
Description:Competition binding assays were carried out using membrane preparations from transfected HN9.10 cells that constitutively expressed the delta opioid receptor.
Residue:372
BDBM50206655
NameBDBM50206655
Synonyms:(S)-N-(1-(2-amino-3-phenylpropanoyl)piperidin-4-yl)-N-phenylpropionamide | CHEMBL231352
TypeSmall organic molecule
Emp. Form.C23H29N3O2
Mol. Mass.379.4953
SMILESCCC(=O)N(C1CCN(CC1)C(=O)[C@@H](N)Cc1ccccc1)c1ccccc1