Reaction Details
TargetMu-type opioid receptor
LigandBDBM50206653
Substrate/Competitorn/a
Meas. Tech.ChEMBL_438449 (CHEMBL887549)
Ki 1900±n/a nM
Citation Lee, YSNyberg, JMoye, SAgnes, RSDavis, PMa, SWLai, JPorreca, FVardanyan, RHruby, VJ Understanding the structural requirements of 4-anilidopiperidine analogues for biological activities at mu and delta opioid receptors. Bioorg Med Chem Lett17:2161-5 (2007) 
 
Mu-type opioid receptor
Name:Mu-type opioid receptor
Type:G Protein-Coupled Receptor (GPCR)
Mol. Mass.:44503.11
Organism:Rattus norvegicus (rat)
Description:Competition binding assays were carried out using membrane preparations from transfected HN9.10 cells that constitutively expressed the mu opioid receptor.
Residue:398
BDBM50206653
NameBDBM50206653
Synonyms:CHEMBL389109 | N-(1-(3-(3-bromophenyl)propanoyl)piperidin-4-yl)-N-phenylpropionamide
TypeSmall organic molecule
Emp. Form.C23H27BrN2O2
Mol. Mass.443.377
SMILESCCC(=O)N(C1CCN(CC1)C(=O)CCc1cccc(Br)c1)c1ccccc1