Reaction Details
TargetMu-type opioid receptor
LigandBDBM50206643
Substrate/Competitorn/a
Meas. Tech.ChEMBL_438449 (CHEMBL887549)
Ki 300±n/a nM
Citation Lee, YSNyberg, JMoye, SAgnes, RSDavis, PMa, SWLai, JPorreca, FVardanyan, RHruby, VJ Understanding the structural requirements of 4-anilidopiperidine analogues for biological activities at mu and delta opioid receptors. Bioorg Med Chem Lett17:2161-5 (2007) 
 
Mu-type opioid receptor
Name:Mu-type opioid receptor
Type:G Protein-Coupled Receptor (GPCR)
Mol. Mass.:44503.11
Organism:Rattus norvegicus (rat)
Description:Competition binding assays were carried out using membrane preparations from transfected HN9.10 cells that constitutively expressed the mu opioid receptor.
Residue:398
BDBM50206643
NameBDBM50206643
Synonyms:CHEMBL390480 | N-(1-((2S,3R)-2-amino-3-(4-hydroxy-2,6-dimethylphenyl)butanoyl)piperidin-4-yl)-N-phenylpropionamide
TypeSmall organic molecule
Emp. Form.C26H35N3O3
Mol. Mass.437.5744
SMILESCCC(=O)N(C1CCN(CC1)C(=O)[C@@H](N)[C@H](C)c1c(C)cc(O)cc1C)c1ccccc1