Reaction Details
TargetMelanin-concentrating hormone receptor 1
LigandBDBM50206671
Substrate/Competitorn/a
Meas. Tech.ChEMBL_442721 (CHEMBL892889)
Ki 39±n/a nM
Citation Zhang, MTamiya, JNguyen, LRowbottom, MWDyck, BVickers, TDGrey, JSchwarz, DAHeise, CEHaelewyn, JMistry, MSGoodfellow, VS Thienopyrimidinone bis-aminopyrrolidine ureas as potent melanin-concentrating hormone receptor-1 (MCH-R1) antagonists. Bioorg Med Chem Lett17:2535-9 (2007) 
 
Melanin-concentrating hormone receptor 1
Name:Melanin-concentrating hormone receptor 1
Type:G Protein-Coupled Receptor (GPCR)
Mol. Mass.:45976.27
Organism:Homo sapiens (Human)
Description:Membranes from CHO-K1 cells stably expressing human MCH1R were used in assays.
Residue:422
BDBM50206671
NameBDBM50206671
Synonyms:(S)-N-methyl-N-((S)-1-methylpyrrolidin-3-yl)-3-(4-oxo-6-(4-(trifluoromethoxy)phenyl)thieno[3,2-d]pyrimidin-3(4H)-yl)pyrrolidine-1-carboxamide | CHEMBL231815
TypeSmall organic molecule
Emp. Form.C24H26F3N5O3S
Mol. Mass.521.555
SMILESCN([C@H]1CCN(C)C1)C(=O)N1CC[C@@H](C1)n1cnc2cc(sc2c1=O)-c1ccc(OC(F)(F)F)cc1