Reaction Details
TargetProstaglandin G/H synthase 1
LigandBDBM50074922
Substrate/Competitorn/a
Meas. Tech.ChEMBL_461152 (CHEMBL944175)
IC50 10±n/a nM
Citation Blobaum, ALMarnett, LJ Structural and functional basis of cyclooxygenase inhibition. J Med Chem50:1425-41 (2007) 
 
Prostaglandin G/H synthase 1
Name:Prostaglandin G/H synthase 1
Type:Enzyme
Mol. Mass.:68692.62
Organism:Homo sapiens (Human)
Description:P23219
Residue:599
BDBM50074922
NameBDBM50074922
Synonyms:(+-)-2-fluoro-alpha-methyl-4-biphenylacetic acid 2-(2-fluorobiphenyl-4-yl)propanoic acid 3-fluoro-4-phenylhydratropic acid CHEMBL563 US9630914, Compound A
TypeSmall organic molecule
Emp. Form.C15H13FO2
Mol. Mass.244.2609
SMILESCC(C(O)=O)c1ccc(c(F)c1)-c1ccccc1