Reaction Details
TargetPeroxisome proliferator-activated receptor gamma
LigandBDBM28661
Substrate/Competitorn/a
Meas. Tech.ChEMBL_428984 (CHEMBL919531)
EC50>10000±n/a nM
Citation Sauerberg, POlsen, GSJeppesen, LMogensen, JPPettersson, IJeppesen, CBDaugaard, JRGalsgaard, EDYnddal, LFleckner, JPanajotova, VPolivka, ZPihera, PHavranek, MWulff, EM Identification and synthesis of a novel selective partial PPARdelta agonist with full efficacy on lipid metabolism in vitro and in vivo. J Med Chem50:1495-503 (2007) 
 
Peroxisome proliferator-activated receptor gamma
Name:Peroxisome proliferator-activated receptor gamma
Type:Nuclear Receptor
Mol. Mass.:57613.46
Organism:Homo sapiens (Human)
Description:P37231
Residue:505
BDBM28661
NameBDBM28661
Synonyms:2-{2-methyl-4-[({4-methyl-2-[4-(trifluoromethyl)phenyl]-1,3-thiazol-5-yl}methyl)sulfanyl]phenoxy}acetic acid GW 501516 GW1516 | GW501516
TypeSmall organic molecule
Emp. Form.C21H18F3NO3S2
Mol. Mass.453.498
SMILESCc1nc(sc1CSc1ccc(OCC(O)=O)c(C)c1)-c1ccc(cc1)C(F)(F)F