Reaction Details
TargetPeroxisome proliferator-activated receptor delta
LigandBDBM50207469
Substrate/Competitorn/a
Meas. Tech.ChEMBL_429020 (CHEMBL918997)
EC50 300±n/a nM
Citation Sauerberg, POlsen, GSJeppesen, LMogensen, JPPettersson, IJeppesen, CBDaugaard, JRGalsgaard, EDYnddal, LFleckner, JPanajotova, VPolivka, ZPihera, PHavranek, MWulff, EM Identification and synthesis of a novel selective partial PPARdelta agonist with full efficacy on lipid metabolism in vitro and in vivo. J Med Chem50:1495-503 (2007) 
 
Peroxisome proliferator-activated receptor delta
Name:Peroxisome proliferator-activated receptor delta
Type:PROTEIN
Mol. Mass.:49719.14
Organism:Mus musculus
Description:ChEMBL_1288931
Residue:440
BDBM50207469
NameBDBM50207469
Synonyms:CHEMBL222880 | {4-[3,3-bis-(4-bromo-phenyl)-allylsulfanyl]-2-chloro-phenoxy}-acetic acid
TypeSmall organic molecule
Emp. Form.C23H17Br2ClO3S
Mol. Mass.568.705
SMILES[#8]-[#6](=O)-[#6]-[#8]-c1ccc(-[#16]-[#6]\[#6]=[#6](/c2ccc(Br)cc2)-c2ccc(Br)cc2)cc1Cl