Reaction Details
TargetVascular endothelial growth factor receptor 2
LigandBDBM50207487
Substrate/Competitorn/a
Meas. Tech.ChEMBL_429056 (CHEMBL920439)
IC50 21±n/a nM
Citation Dai, YHartandi, KJi, ZAhmed, AAAlbert, DHBauch, JLBouska, JJBousquet, PFCunha, GAGlaser, KBHarris, CMHickman, DGuo, JLi, JMarcotte, PAMarsh, KCMoskey, MDMartin, RLOlson, AMOsterling, DJPease, LJSoni, NBStewart, KDStoll, VSTapang, PReuter, DRDavidsen, SKMichaelides, MR Discovery of N-(4-(3-amino-1H-indazol-4-yl)phenyl)-N'-(2-fluoro-5-methylphenyl)urea (ABT-869), a 3-aminoindazole-based orally active multitargeted receptor tyrosine kinase inhibitor. J Med Chem50:1584-97 (2007) 
 
Vascular endothelial growth factor receptor 2
Name:Vascular endothelial growth factor receptor 2
Type:Receptor Tyrosine Kinase
Mol. Mass.:151510.97
Organism:Homo sapiens (Human)
Description:P35968
Residue:1356
BDBM50207487
NameBDBM50207487
Synonyms:1-(4-(3-amino-7-(2-morpholinoethoxy)-1H-indazol-4-yl)phenyl)-3-m-tolylurea N-{4-[3-amino-7-(2-morpholin-4-ylethoxy)-1H-indazol-4-yl]-phenyl}-N'-(3-methylphenyl)urea
TypeSmall organic molecule
Emp. Form.C27H30N6O3
Mol. Mass.486.5655
SMILESCc1cccc(NC(=O)Nc2ccc(cc2)-c2ccc(OCCN3CCOCC3)c3[nH]nc(N)c23)c1