Reaction Details
TargetVascular endothelial growth factor receptor 2
LigandBDBM50207480
Substrate/Competitorn/a
Meas. Tech.ChEMBL_429059 (CHEMBL920442)
IC50 32±n/a nM
Citation Dai, YHartandi, KJi, ZAhmed, AAAlbert, DHBauch, JLBouska, JJBousquet, PFCunha, GAGlaser, KBHarris, CMHickman, DGuo, JLi, JMarcotte, PAMarsh, KCMoskey, MDMartin, RLOlson, AMOsterling, DJPease, LJSoni, NBStewart, KDStoll, VSTapang, PReuter, DRDavidsen, SKMichaelides, MR Discovery of N-(4-(3-amino-1H-indazol-4-yl)phenyl)-N'-(2-fluoro-5-methylphenyl)urea (ABT-869), a 3-aminoindazole-based orally active multitargeted receptor tyrosine kinase inhibitor. J Med Chem50:1584-97 (2007) 
 
Vascular endothelial growth factor receptor 2
Name:Vascular endothelial growth factor receptor 2
Type:Receptor Tyrosine Kinase
Mol. Mass.:151510.97
Organism:Homo sapiens (Human)
Description:P35968
Residue:1356
BDBM50207480
NameBDBM50207480
Synonyms:1-(4-(3-amino-1H-indazol-4-yl)phenyl)-3-(3-(trifluoromethyl)phenyl)urea N-[4-(3-amino-1H-indazol-4-yl)phenyl]-N'-[3-(trifluoromethyl)phenyl]urea
TypeSmall organic molecule
Emp. Form.C21H16F3N5O
Mol. Mass.411.3798
SMILESNc1n[nH]c2cccc(-c3ccc(NC(=O)Nc4cccc(c4)C(F)(F)F)cc3)c12