Reaction Details
TargetVascular endothelial growth factor receptor 2
LigandBDBM50207484
Substrate/Competitorn/a
Meas. Tech.ChEMBL_429059 (CHEMBL920442)
IC50 80±n/a nM
Citation Dai, YHartandi, KJi, ZAhmed, AAAlbert, DHBauch, JLBouska, JJBousquet, PFCunha, GAGlaser, KBHarris, CMHickman, DGuo, JLi, JMarcotte, PAMarsh, KCMoskey, MDMartin, RLOlson, AMOsterling, DJPease, LJSoni, NBStewart, KDStoll, VSTapang, PReuter, DRDavidsen, SKMichaelides, MR Discovery of N-(4-(3-amino-1H-indazol-4-yl)phenyl)-N'-(2-fluoro-5-methylphenyl)urea (ABT-869), a 3-aminoindazole-based orally active multitargeted receptor tyrosine kinase inhibitor. J Med Chem50:1584-97 (2007) 
 
Vascular endothelial growth factor receptor 2
Name:Vascular endothelial growth factor receptor 2
Type:Receptor Tyrosine Kinase
Mol. Mass.:151510.97
Organism:Homo sapiens (Human)
Description:P35968
Residue:1356
BDBM50207484
NameBDBM50207484
Synonyms:1-(4-(3-amino-1H-indazol-4-yl)phenyl)-3-o-tolylurea N-[4-(3-amino-1H-indazol-4-yl)phenyl]-N'-(2-methylphenyl)-urea
TypeSmall organic molecule
Emp. Form.C21H19N5O
Mol. Mass.357.4085
SMILESCc1ccccc1NC(=O)Nc1ccc(cc1)-c1cccc2[nH]nc(N)c12