Reaction Details
TargetMast/stem cell growth factor receptor Kit
LigandBDBM50207474
Substrate/Competitorn/a
Meas. Tech.ChEMBL_429058 (CHEMBL920441)
IC50 10±n/a nM
Citation Dai, YHartandi, KJi, ZAhmed, AAAlbert, DHBauch, JLBouska, JJBousquet, PFCunha, GAGlaser, KBHarris, CMHickman, DGuo, JLi, JMarcotte, PAMarsh, KCMoskey, MDMartin, RLOlson, AMOsterling, DJPease, LJSoni, NBStewart, KDStoll, VSTapang, PReuter, DRDavidsen, SKMichaelides, MR Discovery of N-(4-(3-amino-1H-indazol-4-yl)phenyl)-N'-(2-fluoro-5-methylphenyl)urea (ABT-869), a 3-aminoindazole-based orally active multitargeted receptor tyrosine kinase inhibitor. J Med Chem50:1584-97 (2007) 
 
Mast/stem cell growth factor receptor Kit
Name:Mast/stem cell growth factor receptor Kit
Type:Protein
Mol. Mass.:109869.37
Organism:Homo sapiens (Human)
Description:P10721
Residue:976
BDBM50207474
NameBDBM50207474
Synonyms:1-(4-(3-amino-1H-indazol-4-yl)phenyl)-3-(4-fluoro-3-methylphenyl)urea N-(4-(3-amino-1H-indazol-4-yl)phenyl)-N'-(4-fluoro-3-methylphenyl)urea
TypeSmall organic molecule
Emp. Form.C21H18FN5O
Mol. Mass.375.3989
SMILESCc1cc(NC(=O)Nc2ccc(cc2)-c2cccc3[nH]nc(N)c23)ccc1F