Reaction Details
TargetMast/stem cell growth factor receptor Kit
LigandBDBM50207480
Substrate/Competitorn/a
Meas. Tech.ChEMBL_429058 (CHEMBL920441)
IC50 41±n/a nM
Citation Dai, YHartandi, KJi, ZAhmed, AAAlbert, DHBauch, JLBouska, JJBousquet, PFCunha, GAGlaser, KBHarris, CMHickman, DGuo, JLi, JMarcotte, PAMarsh, KCMoskey, MDMartin, RLOlson, AMOsterling, DJPease, LJSoni, NBStewart, KDStoll, VSTapang, PReuter, DRDavidsen, SKMichaelides, MR Discovery of N-(4-(3-amino-1H-indazol-4-yl)phenyl)-N'-(2-fluoro-5-methylphenyl)urea (ABT-869), a 3-aminoindazole-based orally active multitargeted receptor tyrosine kinase inhibitor. J Med Chem50:1584-97 (2007) 
 
Mast/stem cell growth factor receptor Kit
Name:Mast/stem cell growth factor receptor Kit
Type:Protein
Mol. Mass.:109869.37
Organism:Homo sapiens (Human)
Description:P10721
Residue:976
BDBM50207480
NameBDBM50207480
Synonyms:1-(4-(3-amino-1H-indazol-4-yl)phenyl)-3-(3-(trifluoromethyl)phenyl)urea N-[4-(3-amino-1H-indazol-4-yl)phenyl]-N'-[3-(trifluoromethyl)phenyl]urea
TypeSmall organic molecule
Emp. Form.C21H16F3N5O
Mol. Mass.411.3798
SMILESNc1n[nH]c2cccc(-c3ccc(NC(=O)Nc4cccc(c4)C(F)(F)F)cc3)c12