Reaction Details
TargetVascular endothelial growth factor receptor 2
LigandBDBM50207503
Substrate/Competitorn/a
Meas. Tech.ChEMBL_429059 (CHEMBL920442)
IC50 48.0±n/a nM
Citation Dai, YHartandi, KJi, ZAhmed, AAAlbert, DHBauch, JLBouska, JJBousquet, PFCunha, GAGlaser, KBHarris, CMHickman, DGuo, JLi, JMarcotte, PAMarsh, KCMoskey, MDMartin, RLOlson, AMOsterling, DJPease, LJSoni, NBStewart, KDStoll, VSTapang, PReuter, DRDavidsen, SKMichaelides, MR Discovery of N-(4-(3-amino-1H-indazol-4-yl)phenyl)-N'-(2-fluoro-5-methylphenyl)urea (ABT-869), a 3-aminoindazole-based orally active multitargeted receptor tyrosine kinase inhibitor. J Med Chem50:1584-97 (2007) 
 
Vascular endothelial growth factor receptor 2
Name:Vascular endothelial growth factor receptor 2
Type:Receptor Tyrosine Kinase
Mol. Mass.:151510.97
Organism:Homo sapiens (Human)
Description:P35968
Residue:1356
BDBM50207503
NameBDBM50207503
Synonyms:1-(4-(3-amino-1H-indazol-4-yl)phenyl)-3-(3-fluoro-4-methylphenyl)urea N-[4-(3-amino-1H-indazol-4-yl)phenyl]-N'-(3-fluoro-4-methylphenyl)urea
TypeSmall organic molecule
Emp. Form.C21H18FN5O
Mol. Mass.375.3989
SMILESCc1ccc(NC(=O)Nc2ccc(cc2)-c2cccc3[nH]nc(N)c23)cc1F