Reaction Details
TargetRAC-alpha serine/threonine-protein kinase
LigandBDBM21079
Substrate/Competitorn/a
Meas. Tech.ChEMBL_429075 (CHEMBL919919)
IC50 50000±n/a nM
Citation Dai, YHartandi, KJi, ZAhmed, AAAlbert, DHBauch, JLBouska, JJBousquet, PFCunha, GAGlaser, KBHarris, CMHickman, DGuo, JLi, JMarcotte, PAMarsh, KCMoskey, MDMartin, RLOlson, AMOsterling, DJPease, LJSoni, NBStewart, KDStoll, VSTapang, PReuter, DRDavidsen, SKMichaelides, MR Discovery of N-(4-(3-amino-1H-indazol-4-yl)phenyl)-N'-(2-fluoro-5-methylphenyl)urea (ABT-869), a 3-aminoindazole-based orally active multitargeted receptor tyrosine kinase inhibitor. J Med Chem50:1584-97 (2007) 
 
RAC-alpha serine/threonine-protein kinase
Name:RAC-alpha serine/threonine-protein kinase
Type:Enzyme
Mol. Mass.:55681.25
Organism:Homo sapiens (Human)
Description:P31749
Residue:480
BDBM21079
NameBDBM21079
Synonyms:1-[4-(3-amino-1H-indazol-4-yl)phenyl]-3-(2-fluoro-5-methyl-phenyl)urea 1-[4-(3-azanyl-1H-indazol-4-yl)phenyl]-3-(2-fluoranyl-5-methyl-phenyl)urea ABT-869 CHEMBL223360 | cid_11485656
TypeSmall organic molecule
Emp. Form.C21H18FN5O
Mol. Mass.375.3989
SMILESCc1ccc(F)c(NC(=O)Nc2ccc(cc2)-c2cccc3[nH]nc(N)c23)c1