Reaction Details
TargetVascular endothelial growth factor receptor 2
LigandBDBM50207490
Substrate/Competitorn/a
Meas. Tech.ChEMBL_429059 (CHEMBL920442)
IC50 16±n/a nM
Citation Dai, YHartandi, KJi, ZAhmed, AAAlbert, DHBauch, JLBouska, JJBousquet, PFCunha, GAGlaser, KBHarris, CMHickman, DGuo, JLi, JMarcotte, PAMarsh, KCMoskey, MDMartin, RLOlson, AMOsterling, DJPease, LJSoni, NBStewart, KDStoll, VSTapang, PReuter, DRDavidsen, SKMichaelides, MR Discovery of N-(4-(3-amino-1H-indazol-4-yl)phenyl)-N'-(2-fluoro-5-methylphenyl)urea (ABT-869), a 3-aminoindazole-based orally active multitargeted receptor tyrosine kinase inhibitor. J Med Chem50:1584-97 (2007) 
 
Vascular endothelial growth factor receptor 2
Name:Vascular endothelial growth factor receptor 2
Type:Receptor Tyrosine Kinase
Mol. Mass.:151510.97
Organism:Homo sapiens (Human)
Description:P35968
Residue:1356
BDBM50207490
NameBDBM50207490
Synonyms:1-(4-(3-amino-1-(2-methoxyethoxy)-1H-indazol-4-yl)phenyl)-3-(3-chlorophenyl)urea | CHEMBL223129
TypeSmall organic molecule
Emp. Form.C23H22ClN5O3
Mol. Mass.451.905
SMILESCOCCOn1nc(N)c2c(cccc12)-c1ccc(NC(=O)Nc2cccc(Cl)c2)cc1