Reaction Details
TargetSodium/hydrogen exchanger 1
LigandBDBM50207583
Substrate/Competitorn/a
Meas. Tech.ChEMBL_443066 (CHEMBL892197)
IC50 4.05±n/a nM
Citation Zhang, RLei, LXu, YGHua, WYGong, GQ Benzimidazol-2-yl or benzimidazol-2-ylthiomethyl benzoylguanidines as novel Na+/H+ exchanger inhibitors, synthesis and protection against ischemic-reperfusion injury. Bioorg Med Chem Lett17:2430-3 (2007) 
 
Sodium/hydrogen exchanger 1
Name:Sodium/hydrogen exchanger 1
Type:PROTEIN
Mol. Mass.:91655.00
Organism:Rattus norvegicus
Description:ChEMBL_862370
Residue:820
BDBM50207583
NameBDBM50207583
Synonyms:CHEMBL234279 | N-[2-(5-nitro-1H-benzoimidazol-2-yl)-benzoyl]-guanidine
TypeSmall organic molecule
Emp. Form.C15H12N6O3
Mol. Mass.324.2942
SMILESNC(=N)NC(=O)c1ccccc1-c1nc2ccc(cc2[nH]1)[N+]([O-])=O