Reaction Details
TargetGlycylpeptide N-tetradecanoyltransferase
LigandBDBM50207643
Substrate/Competitorn/a
Meas. Tech.ChEMBL_458963 (CHEMBL925057)
IC50 0.49±n/a nM
Citation Sheng, CZhu, JZhang, WZhang, MJi, HSong, YXu, HYao, JMiao, ZZhou, YZhu, JLü, J 3D-QSAR and molecular docking studies on benzothiazole derivatives as Candida albicans N-myristoyltransferase inhibitors. Eur J Med Chem42:477-86 (2007) 
 
Glycylpeptide N-tetradecanoyltransferase
Name:Glycylpeptide N-tetradecanoyltransferase
Type:Enzyme
Mol. Mass.:51875.96
Organism:Candida albicans (Yeast)
Description:P30418
Residue:451
BDBM50207643
NameBDBM50207643
Synonyms:(1S,3R)-N-(2-(cyclopentanecarboxamido)benzo[d]thiazol-6-yl)-3-(naphthalen-2-ylmethylamino)cyclohexanecarboxamide | CHEMBL253804
TypeSmall organic molecule
Emp. Form.C31H34N4O2S
Mol. Mass.526.692
SMILESO=C(Nc1nc2ccc(NC(=O)[C@H]3CCC[C@H](C3)NCc3ccc4ccccc4c3)cc2s1)C1CCCC1