Reaction Details
TargetGlycylpeptide N-tetradecanoyltransferase
LigandBDBM50207640
Substrate/Competitorn/a
Meas. Tech.ChEMBL_458963 (CHEMBL925057)
IC50 2.3±n/a nM
Citation Sheng, CZhu, JZhang, WZhang, MJi, HSong, YXu, HYao, JMiao, ZZhou, YZhu, JLü, J 3D-QSAR and molecular docking studies on benzothiazole derivatives as Candida albicans N-myristoyltransferase inhibitors. Eur J Med Chem42:477-86 (2007) 
 
Glycylpeptide N-tetradecanoyltransferase
Name:Glycylpeptide N-tetradecanoyltransferase
Type:Enzyme
Mol. Mass.:51875.96
Organism:Candida albicans (Yeast)
Description:P30418
Residue:451
BDBM50207640
NameBDBM50207640
Synonyms:CHEMBL254011 | N-(2-(cyclobutanecarboxamido)benzo[d]thiazol-6-yl)-3-(naphthalen-2-ylmethylamino)cyclohexanecarboxamide
TypeSmall organic molecule
Emp. Form.C30H32N4O2S
Mol. Mass.512.666
SMILESO=C(Nc1nc2ccc(NC(=O)C3CCCC(C3)NCc3ccc4ccccc4c3)cc2s1)C1CCC1