Reaction Details
TargetDelta-type opioid receptor
LigandBDBM50207835
Substrate/Competitorn/a
Meas. Tech.ChEMBL_455040 (CHEMBL887069)
Ki 3.8±n/a nM
Citation Dolle, REMichaut, MMartinez-Teipel, BBelanger, SGraczyk, TMDeHaven, RN Further studies of tyrosine surrogates in opioid receptor peptide ligands. Bioorg Med Chem Lett17:2656-60 (2007) 
 
Delta-type opioid receptor
Name:Delta-type opioid receptor
Type:G Protein-Coupled Receptor (GPCR)
Mol. Mass.:40382.98
Organism:Homo sapiens (Human)
Description:Competition binding assays were carried out using membrane preparations from transfected HN9.10 cells that constitutively expressed the delta opioid receptor.
Residue:372
BDBM50207835
NameBDBM50207835
Synonyms:CHEMBL246479 | H-Aba-ser-Gly-Phe-Leu-Thr-OH
TypeSmall organic molecule
Emp. Form.C34H46N8O9S
Mol. Mass.742.842
SMILESCC(C)C[C@H](NC(=O)[C@H](Cc1ccccc1)NC(=O)CNC(=O)[C@H](CO)NC(=O)[C@@H](N)Cc1ccc2nc(N)sc2c1)C(=O)N[C@@H]([C@@H](C)O)C(O)=O