Reaction Details
TargetDelta-type opioid receptor
LigandBDBM50207824
Substrate/Competitorn/a
Meas. Tech.ChEMBL_455044 (CHEMBL887073)
EC50 320±n/a nM
Citation Dolle, REMichaut, MMartinez-Teipel, BBelanger, SGraczyk, TMDeHaven, RN Further studies of tyrosine surrogates in opioid receptor peptide ligands. Bioorg Med Chem Lett17:2656-60 (2007) 
 
Delta-type opioid receptor
Name:Delta-type opioid receptor
Type:G Protein-Coupled Receptor (GPCR)
Mol. Mass.:40382.98
Organism:Homo sapiens (Human)
Description:Competition binding assays were carried out using membrane preparations from transfected HN9.10 cells that constitutively expressed the delta opioid receptor.
Residue:372
BDBM50207824
NameBDBM50207824
Synonyms:CHEMBL2372104 | H-Cpa-c[pen-Gly-Phe-pen]OH
TypeSmall organic molecule
Emp. Form.C31H40N6O7S2
Mol. Mass.672.815
SMILESCC1(C)SSC(C)(C)[C@@H](NC(=O)[C@@H](N)Cc2ccc(cc2)C(N)=O)C(=O)NCC(=O)N[C@@H](Cc2ccccc2)C(=O)N[C@H]1C(O)=O