Reaction Details
TargetDelta-type opioid receptor
LigandBDBM50207826
Substrate/Competitorn/a
Meas. Tech.ChEMBL_455040 (CHEMBL887069)
Ki 42±n/a nM
Citation Dolle, REMichaut, MMartinez-Teipel, BBelanger, SGraczyk, TMDeHaven, RN Further studies of tyrosine surrogates in opioid receptor peptide ligands. Bioorg Med Chem Lett17:2656-60 (2007) 
 
Delta-type opioid receptor
Name:Delta-type opioid receptor
Type:G Protein-Coupled Receptor (GPCR)
Mol. Mass.:40382.98
Organism:Homo sapiens (Human)
Description:Competition binding assays were carried out using membrane preparations from transfected HN9.10 cells that constitutively expressed the delta opioid receptor.
Residue:372
BDBM50207826
NameBDBM50207826
Synonyms:CHEMBL393867 | H-mCpa-ser-Gly-Phe-Leu-Thr-OH
TypeSmall organic molecule
Emp. Form.C34H47N7O10
Mol. Mass.713.7779
SMILESCC(C)C[C@H](NC(=O)[C@H](Cc1ccccc1)NC(=O)CNC(=O)[C@H](CO)NC(=O)[C@@H](N)Cc1cccc(c1)C(N)=O)C(=O)N[C@@H]([C@@H](C)O)C(O)=O