Reaction Details
TargetDelta-type opioid receptor
LigandBDBM50207836
Substrate/Competitorn/a
Meas. Tech.ChEMBL_455040 (CHEMBL887069)
Ki 19±n/a nM
Citation Dolle, REMichaut, MMartinez-Teipel, BBelanger, SGraczyk, TMDeHaven, RN Further studies of tyrosine surrogates in opioid receptor peptide ligands. Bioorg Med Chem Lett17:2656-60 (2007) 
 
Delta-type opioid receptor
Name:Delta-type opioid receptor
Type:G Protein-Coupled Receptor (GPCR)
Mol. Mass.:40382.98
Organism:Homo sapiens (Human)
Description:Competition binding assays were carried out using membrane preparations from transfected HN9.10 cells that constitutively expressed the delta opioid receptor.
Residue:372
BDBM50207836
NameBDBM50207836
Synonyms:CHEMBL247759 | H-Aba-Gly-Gly-Phe-Leu-OH
TypeSmall organic molecule
Emp. Form.C29H37N7O6S
Mol. Mass.611.712
SMILESCC(C)C[C@H](NC(=O)[C@H](Cc1ccccc1)NC(=O)CNC(=O)CNC(=O)[C@@H](N)Cc1ccc2nc(N)sc2c1)C(O)=O