Reaction Details
TargetDelta-type opioid receptor
LigandBDBM50207825
Substrate/Competitorn/a
Meas. Tech.ChEMBL_455040 (CHEMBL887069)
Ki 1±n/a nM
Citation Dolle, REMichaut, MMartinez-Teipel, BBelanger, SGraczyk, TMDeHaven, RN Further studies of tyrosine surrogates in opioid receptor peptide ligands. Bioorg Med Chem Lett17:2656-60 (2007) 
 
Delta-type opioid receptor
Name:Delta-type opioid receptor
Type:G Protein-Coupled Receptor (GPCR)
Mol. Mass.:40382.98
Organism:Homo sapiens (Human)
Description:Competition binding assays were carried out using membrane preparations from transfected HN9.10 cells that constitutively expressed the delta opioid receptor.
Residue:372
BDBM50207825
NameBDBM50207825
Synonyms:CHEMBL246739 | H-Cdp-Gly-Gly-Phe-Leu-OH
TypeSmall organic molecule
Emp. Form.C31H42N6O7
Mol. Mass.610.7012
SMILESCC(C)C[C@H](NC(=O)[C@H](Cc1ccccc1)NC(=O)CNC(=O)CNC(=O)[C@@H](N)Cc1c(C)cc(cc1C)C(N)=O)C(O)=O