Reaction Details
TargetMu-type opioid receptor
LigandBDBM50207822
Substrate/Competitorn/a
Meas. Tech.ChEMBL_455039 (CHEMBL887068)
EC50 270±n/a nM
Citation Dolle, REMichaut, MMartinez-Teipel, BBelanger, SGraczyk, TMDeHaven, RN Further studies of tyrosine surrogates in opioid receptor peptide ligands. Bioorg Med Chem Lett17:2656-60 (2007) 
 
Mu-type opioid receptor
Name:Mu-type opioid receptor
Type:G Protein-Coupled Receptor (GPCR)
Mol. Mass.:44789.51
Organism:Homo sapiens (Human)
Description:P35372
Residue:400
BDBM50207822
NameBDBM50207822
Synonyms:CHEMBL246956 | H-Cpa-Gly-Gly-Phe-Met-NH2
TypeSmall organic molecule
Emp. Form.C28H37N7O6S
Mol. Mass.599.702
SMILESCSCC[C@H](NC(=O)[C@H](Cc1ccccc1)NC(=O)CNC(=O)CNC(=O)[C@@H](N)Cc1ccc(cc1)C(N)=O)C(N)=O