Reaction Details
TargetMu-type opioid receptor
LigandBDBM50207826
Substrate/Competitorn/a
Meas. Tech.ChEMBL_455039 (CHEMBL887068)
Ki 1100±n/a nM
Citation Dolle, REMichaut, MMartinez-Teipel, BBelanger, SGraczyk, TMDeHaven, RN Further studies of tyrosine surrogates in opioid receptor peptide ligands. Bioorg Med Chem Lett17:2656-60 (2007) 
 
Mu-type opioid receptor
Name:Mu-type opioid receptor
Type:G Protein-Coupled Receptor (GPCR)
Mol. Mass.:44789.51
Organism:Homo sapiens (Human)
Description:P35372
Residue:400
BDBM50207826
NameBDBM50207826
Synonyms:CHEMBL393867 | H-mCpa-ser-Gly-Phe-Leu-Thr-OH
TypeSmall organic molecule
Emp. Form.C34H47N7O10
Mol. Mass.713.7779
SMILESCC(C)C[C@H](NC(=O)[C@H](Cc1ccccc1)NC(=O)CNC(=O)[C@H](CO)NC(=O)[C@@H](N)Cc1cccc(c1)C(N)=O)C(=O)N[C@@H]([C@@H](C)O)C(O)=O