Reaction Details
TargetMu-type opioid receptor
LigandBDBM50207825
Substrate/Competitorn/a
Meas. Tech.ChEMBL_455039 (CHEMBL887068)
Ki 9.8±n/a nM
Citation Dolle, REMichaut, MMartinez-Teipel, BBelanger, SGraczyk, TMDeHaven, RN Further studies of tyrosine surrogates in opioid receptor peptide ligands. Bioorg Med Chem Lett17:2656-60 (2007) 
 
Mu-type opioid receptor
Name:Mu-type opioid receptor
Type:G Protein-Coupled Receptor (GPCR)
Mol. Mass.:44789.51
Organism:Homo sapiens (Human)
Description:P35372
Residue:400
BDBM50207825
NameBDBM50207825
Synonyms:CHEMBL246739 | H-Cdp-Gly-Gly-Phe-Leu-OH
TypeSmall organic molecule
Emp. Form.C31H42N6O7
Mol. Mass.610.7012
SMILESCC(C)C[C@H](NC(=O)[C@H](Cc1ccccc1)NC(=O)CNC(=O)CNC(=O)[C@@H](N)Cc1c(C)cc(cc1C)C(N)=O)C(O)=O