Reaction Details
TargetKappa-type opioid receptor
LigandBDBM50207827
Substrate/Competitorn/a
Meas. Tech.ChEMBL_455041 (CHEMBL887070)
Ki>10000±n/a nM
Citation Dolle, REMichaut, MMartinez-Teipel, BBelanger, SGraczyk, TMDeHaven, RN Further studies of tyrosine surrogates in opioid receptor peptide ligands. Bioorg Med Chem Lett17:2656-60 (2007) 
 
Kappa-type opioid receptor
Name:Kappa-type opioid receptor
Type:G Protein-Coupled Receptor (GPCR)
Mol. Mass.:42648.76
Organism:Homo sapiens (Human)
Description:P41145
Residue:380
BDBM50207827
NameBDBM50207827
Synonyms:CHEMBL392275 | H-mCpa-Gly-Gly-Phe-Leu-OH
TypeSmall organic molecule
Emp. Form.C29H38N6O7
Mol. Mass.582.648
SMILESCC(C)C[C@H](NC(=O)[C@H](Cc1ccccc1)NC(=O)CNC(=O)CNC(=O)[C@@H](N)Cc1cccc(c1)C(N)=O)C(O)=O