Reaction Details
TargetKappa-type opioid receptor
LigandBDBM50207826
Substrate/Competitorn/a
Meas. Tech.ChEMBL_455041 (CHEMBL887070)
Ki>10000±n/a nM
Citation Dolle, REMichaut, MMartinez-Teipel, BBelanger, SGraczyk, TMDeHaven, RN Further studies of tyrosine surrogates in opioid receptor peptide ligands. Bioorg Med Chem Lett17:2656-60 (2007) 
 
Kappa-type opioid receptor
Name:Kappa-type opioid receptor
Type:G Protein-Coupled Receptor (GPCR)
Mol. Mass.:42648.76
Organism:Homo sapiens (Human)
Description:P41145
Residue:380
BDBM50207826
NameBDBM50207826
Synonyms:CHEMBL393867 | H-mCpa-ser-Gly-Phe-Leu-Thr-OH
TypeSmall organic molecule
Emp. Form.C34H47N7O10
Mol. Mass.713.7779
SMILESCC(C)C[C@H](NC(=O)[C@H](Cc1ccccc1)NC(=O)CNC(=O)[C@H](CO)NC(=O)[C@@H](N)Cc1cccc(c1)C(N)=O)C(=O)N[C@@H]([C@@H](C)O)C(O)=O