Reaction Details
TargetKappa-type opioid receptor
LigandBDBM50019056
Substrate/Competitorn/a
Meas. Tech.ChEMBL_455041 (CHEMBL887070)
Ki>10000±n/a nM
Citation Dolle, REMichaut, MMartinez-Teipel, BBelanger, SGraczyk, TMDeHaven, RN Further studies of tyrosine surrogates in opioid receptor peptide ligands. Bioorg Med Chem Lett17:2656-60 (2007) 
 
Kappa-type opioid receptor
Name:Kappa-type opioid receptor
Type:G Protein-Coupled Receptor (GPCR)
Mol. Mass.:42648.76
Organism:Homo sapiens (Human)
Description:P41145
Residue:380
BDBM50019056
NameBDBM50019056
Synonyms:(S)-2-[(S)-2-(2-{2-[(S)-2-Amino-3-(4-hydroxy-phenyl)-propionylamino]-acetylamino}-acetylamino)-3-phenyl-propionylamino]-4-methylsulfanyl-butyric acid 2-[(S)-2-(2-{2-[(S)-2-Amino-3-(4-hydroxy-phenyl)-propionylamino]-acetylamino}-acetylamino)-1-oxo-3-phenyl-propylamino]-4-methylsulfanyl-butyric acid 2-[2-(2-{2-[2-Amino-3-(4-hydroxy-phenyl)-propionylamino]-acetylamino}-acetylamino)-3-phenyl-propionylamino]-4-methylsulfanyl-butyric acid H-Tyr-Gly-Gly-Phe-Met-OH [Met5]-enkephalin | met-enkephalin
TypeSmall organic molecule
Emp. Form.C27H35N5O7S
Mol. Mass.573.661
SMILESCSCC[C@H](NC(=O)[C@H](Cc1ccccc1)NC(=O)CNC(=O)CNC(=O)[C@@H](N)Cc1ccc(O)cc1)C(O)=O