Reaction Details
TargetMu-type opioid receptor
LigandBDBM50207838
Substrate/Competitorn/a
Meas. Tech.ChEMBL_455039 (CHEMBL887068)
Ki>10000±n/a nM
Citation Dolle, REMichaut, MMartinez-Teipel, BBelanger, SGraczyk, TMDeHaven, RN Further studies of tyrosine surrogates in opioid receptor peptide ligands. Bioorg Med Chem Lett17:2656-60 (2007) 
 
Mu-type opioid receptor
Name:Mu-type opioid receptor
Type:G Protein-Coupled Receptor (GPCR)
Mol. Mass.:44789.51
Organism:Homo sapiens (Human)
Description:P35372
Residue:400
BDBM50207838
NameBDBM50207838
Synonyms:CHEMBL247562 | H-Poa-ala-Gly-Phe-leu-OH
TypeSmall organic molecule
Emp. Form.C28H38N6O7
Mol. Mass.570.6373
SMILESCC(C)C[C@H](NC(=O)[C@H](Cc1ccccc1)NC(=O)CNC(=O)[C@H](C)NC(=O)[C@@H](N)Cc1cc[n+]([O-])cc1)C(O)=O